Город МОСКОВСКИЙ
00:01:42

FAILURE: Build failed with an exception Exception: Gradle task assembleDebug failed with exit code

Аватар
React Стратегии
Просмотры:
241
Дата загрузки:
28.11.2023 07:06
Длительность:
00:01:42
Категория:
Обучение

Описание

FAILURE: Build failed with an exception Exception: Gradle task assembleDebug failed with exit code 1

Buy me a Coffee : https://www.buymeacoffee.com/pwhservices
Medium Com : https://medium.com/@programmingwithhassan/failure-build-failed-with-an-exception-exception-gradle-task-assembledebug-failed-with-exit-code-c73eb2388ac1
PWH SERVICES : https://pwhservices.tech/

Рекомендуемые видео